Target
Replicase polyprotein 1ab
Ligand
BDBM525225
Substrate
Meas. Tech.
SARS-CoV-2 3CLPpro inhibition assay
IC50
13±n/a nM
Citation
 Chen, JLiang, CMIAO, KWu, YYun, HZhang, W Aminocarbamoyl compounds for the treatment of viral infections WIPO 0:0 (2022) Target
Name:
Replicase polyprotein 1ab
Synonyms:
ORF1ab polyprotein pp1ab | rep
Type:
Protein
Mol. Mass.:
794070.71
Organism:
2019-nCoV
Description:
P0DTD1
Residue:
7096
  
Inhibitor
Name:
BDBM525225
Synonyms:
N-[(1S)-1-[[(3-amino-3-oxo-propyl)-(2-chloro-2-fluoro-acetyl)amino]carbamoyl]-3,3-dimethyl-butyl]-1H-benzimidazole-2-carboxamide | WO2022043374, Example 65-B
Type:
Small organic molecule
Emp. Form.:
C20H26ClFN6O4
Mol. Mass.:
468.91
SMILES:
CC(C)(C)C[C@H](NC(=O)c1nc2ccccc2[nH]1)C(=O)NN(CCC(N)=O)C(=O)[C@H](F)Cl
: