Target
Replicase polyprotein 1ab
Ligand
BDBM525251
Substrate
Meas. Tech.
SARS-CoV-2 3CLPpro inhibition assay
IC50
24±n/a nM
Citation
 Chen, JLiang, CMIAO, KWu, YYun, HZhang, W Aminocarbamoyl compounds for the treatment of viral infections WIPO 0:0 (2022) Target
Name:
Replicase polyprotein 1ab
Synonyms:
ORF1ab polyprotein pp1ab | rep
Type:
Protein
Mol. Mass.:
794070.71
Organism:
2019-nCoV
Description:
P0DTD1
Residue:
7096
  
Inhibitor
Name:
BDBM525251
Synonyms:
N-[(1S)-2-[2-[(2R)-2-chloro-2-fluoro-acetyl]-2-[[(3S)-2-oxopyrrolidin-3-yl]methyl]hydrazino]-1-[(1-methylcyclopropyl)methyl]-2-oxo-ethyl]-5-(difluoromethyl)isoxazole-3-carboxamide | WO2022043374, Example 100
Type:
Small organic molecule
Emp. Form.:
C20H23ClF3N5O5
Mol. Mass.:
505.875
SMILES:
FC(F)c1cc(no1)C(=O)N[C@@H](CC12CC(C1)C2)C(=O)NN(C[C@@H]1CCNC1=O)C(=O)[C@H](F)Cl
: