Target
Replicase polyprotein 1ab
Ligand
BDBM525203
Substrate
Meas. Tech.
SARS-CoV 3CLp ro inhibition assay
IC50
15±n/a nM
Citation
 Chen, JLiang, CMIAO, KWu, YYun, HZhang, W Aminocarbamoyl compounds for the treatment of viral infections WIPO 0:0 (2022) Target
Name:
Replicase polyprotein 1ab
Synonyms:
3C-like proteinase 3C-like proteinase (SARS-CoV 3Cpro) 3CLp GFL Guanine-N7 methyltransferase Helicase Leader protein Non-structural protein 10 Non-structural protein 3 Non-structural protein 6 Non-structural protein 8 ORF1ab polyprotein PL2-PRO Pol R1AB_SARS RdRp SARS coronavirus main proteinase nsp1 nsp12 nsp14 nsp16 nsp3 nsp5 nsp7 nsp9 pp1ab | rep
Type:
Protein
Mol. Mass.:
790250.81
Organism:
Human SARS coronavirus (SARS-CoV) (Severe acute respiratory syndrome coronavirus)
Description:
P0C6X7
Residue:
7073
  
Inhibitor
Name:
BDBM525203
Synonyms:
N-[(1S)-1-[[(2-Chloroacetyl)-[(2-oxo-pyrrolidin-3-yl)methyl]amino]carbamoyl]-3-methyl-butyl]-1H-indole-2-carboxamide | WO2022043374, Example 51-A
Type:
Small organic molecule
Emp. Form.:
C22H28ClN5O4
Mol. Mass.:
461.942
SMILES:
CC(C)C[C@H](NC(=O)c1cc2ccccc2[nH]1)C(=O)NN(C[C@H]1CCNC1=O)C(=O)CCl
: