Target
Orf1a protein
Ligand
BDBM525229
Substrate
Meas. Tech.
MERS-CoV 3CLp ro inhibition assay
IC50
16±n/a nM
Citation
 Chen, JLiang, CMIAO, KWu, YYun, HZhang, W Aminocarbamoyl compounds for the treatment of viral infections WIPO 0:0 (2022) Target
Name:
Orf1a protein
Synonyms:
3C-like proteinase Leader protein Non-structural protein 2 Non-structural protein 4 Non-structural protein 7 Non-structural protein 9 nsp5 | p65 homolog
Type:
Protein
Mol. Mass.:
486041.74
Organism:
MERS-CoV
Description:
A0A1L2E0X0
Residue:
4391
  
Inhibitor
Name:
BDBM525229
Synonyms:
N-[(1S)-1-(1-bicyclo[1.1.1]pentanylmethyl)-2-[2-[(2R)-2-chloro-2-fluoro-acetyl]-2-[[(3S)-2-oxopyrrolidin-3-yl]methyl]hydrazino]-2-oxo-ethyl]-5-methyl-isoxazole-3-carboxamide | WO2022043374, Example 71
Type:
Small organic molecule
Emp. Form.:
C20H25ClFN5O5
Mol. Mass.:
469.894
SMILES:
Cc1cc(no1)C(=O)N[C@@H](CC12CC(C1)C2)C(=O)NN(C[C@H]1CCNC1=O)C(=O)[C@H](F)Cl
: