Target
Serine protease hepsin
Ligand
BDBM525256
Substrate
Meas. Tech.
TMPRSS2 pericellular activity screening assay
Ki
31±3.00 nM
Citation
 Shapira, TMonreal, IADion, SPBuchholz, DWImbiakha, BOlmstead, ADJager, MDésilets, AGao, GMartins, MVandal, TThompson, CAHChin, ARees, WDSteiner, TNabi, IRMarsault, ESahler, JDiel, DGVan de Walle, GRAugust, AWhittaker, GRBoudreault, PLLeduc, RAguilar, HCJean, F A TMPRSS2 inhibitor acts as a pan-SARS-CoV-2 prophylactic and therapeutic. Nature 0:0 (2022)  
Target
Name:
Serine protease hepsin
Synonyms:
HEPS_HUMAN Hepsin TMPRSS1 Transmembrane protease, serine 1
Type:
Enzyme
Mol. Mass.:
45016.98
Organism:
Homo sapiens (Human)
Description:
Human deglycosylated hepsin was expressed in Pichia pastoris.
Residue:
417
  
Inhibitor
Name:
BDBM525256
Synonyms:
(H)Arg-Glu-Phe-Arg-kbt | N-0438
Type:
Small organic molecule
Emp. Form.:
C33H45N11O6S
Mol. Mass.:
723.845
SMILES:
N[C@@H](CCCNC(N)=N)C(=O)N[C@@H](CCC(O)=O)C(=O)N[C@@H](Cc1ccccc1)C(=O)N[C@@H](CCCNC(N)=N)C(=O)c1nc2ccccc2s1
: