Target
Serine protease hepsin
Ligand
BDBM50031706
Substrate
Meas. Tech.
TMPRSS2 pericellular activity screening assay
Ki
5.80±3.40 nM
Citation
 Shapira, TMonreal, IADion, SPBuchholz, DWImbiakha, BOlmstead, ADJager, MDésilets, AGao, GMartins, MVandal, TThompson, CAHChin, ARees, WDSteiner, TNabi, IRMarsault, ESahler, JDiel, DGVan de Walle, GRAugust, AWhittaker, GRBoudreault, PLLeduc, RAguilar, HCJean, F A TMPRSS2 inhibitor acts as a pan-SARS-CoV-2 prophylactic and therapeutic. Nature 0:0 (2022)  
Target
Name:
Serine protease hepsin
Synonyms:
HEPS_HUMAN Hepsin TMPRSS1 Transmembrane protease, serine 1
Type:
Enzyme
Mol. Mass.:
45016.98
Organism:
Homo sapiens (Human)
Description:
Human deglycosylated hepsin was expressed in Pichia pastoris.
Residue:
417
  
Inhibitor
Name:
BDBM50031706
Synonyms:
4-Guanidino-benzoic acid 4-dimethylcarbamoylmethoxycarbonylmethyl-phenyl ester; compound with methanesulfonic acid Camostat | med.21724, Compound 18
Type:
Small organic molecule
Emp. Form.:
C20H22N4O5
Mol. Mass.:
398.4125
SMILES:
[#6]-[#7](-[#6])-[#6](=O)-[#6]-[#8]-[#6](=O)-[#6]-c1ccc(-[#8]-[#6](=O)-c2ccc(cc2)\[#7]=[#6](/[#7])-[#7])cc1
: