Target
Procathepsin L
Ligand
BDBM50032698
Substrate
Meas. Tech.
TMPRSS2 pericellular activity screening assay
Ki
>10000±n/a nM
Citation
 Shapira, TMonreal, IADion, SPBuchholz, DWImbiakha, BOlmstead, ADJager, MDésilets, AGao, GMartins, MVandal, TThompson, CAHChin, ARees, WDSteiner, TNabi, IRMarsault, ESahler, JDiel, DGVan de Walle, GRAugust, AWhittaker, GRBoudreault, PLLeduc, RAguilar, HCJean, F A TMPRSS2 inhibitor acts as a pan-SARS-CoV-2 prophylactic and therapeutic. Nature 0:0 (2022)  
Target
Name:
Procathepsin L
Synonyms:
CATL1_HUMAN CTSL CTSL1 Cathepsin L Cathepsin L1 heavy chain MEP cathepsin L preproprotein
Type:
Enzyme
Mol. Mass.:
37557.19
Organism:
Homo sapiens (Human)
Description:
Purchased from Calbiochem (San Diego, CA).
Residue:
333
  
Inhibitor
Name:
BDBM50032698
Synonyms:
CHEMBL3354676 | N-0130
Type:
Small organic molecule
Emp. Form.:
C33H46N12O5S
Mol. Mass.:
722.861
SMILES:
N[C@@H](CCCNC(N)=N)C(=O)N[C@@H](CCC(N)=O)C(=O)N[C@@H](Cc1ccccc1)C(=O)N[C@@H](CCCNC(N)=N)C(=O)c1nc2ccccc2s1
: