Target
Angiotensin-converting enzyme/Ribosomal RNA small subunit methyltransferase NEP1
Ligand
BDBM471714
Substrate
Meas. Tech.
Enzyme Inhibition Assay
Ki
<1.000±n/a nM
Citation
 Fleury, MHughes, AD Neprilysin inhibitors US Patent  US11174219 Publication Date 11/16/2021 
Target
Name:
Angiotensin-converting enzyme/Ribosomal RNA small subunit methyltransferase NEP1
Synonyms:
Recombinant human NEP and recombinant human ACE
Type:
Protein
Mol. Mass.:
Description:
Components:
This complex has 2 components.
Component 1
Name:
Ribosomal RNA small subunit methyltransferase NEP1
Synonyms:
18S rRNA (pseudouridine(1248)-N1)-methyltransferase C2F NEP1_HUMAN Protein C2f | Ribosome biogenesis protein NEP1
Type:
Protein
Mol. Mass.:
26729.88
Organism:
Human
Description:
Q92979
Residue:
244
  
Component 2
Name:
Angiotensin-converting enzyme
Synonyms:
ACE Angiotensin converting enzyme (ACE) Angiotensin-converting enzyme, soluble form CD_antigen=CD143 DCP1 Kininase II
Type:
Enzyme
Mol. Mass.:
149709.01
Organism:
Homo sapiens (Human)
Description:
Residue:
1306
  
Inhibitor
Name:
BDBM471714
Synonyms:
US10829438, Example 6A | US11174219, Example 6A
Type:
Small organic molecule
Emp. Form.:
C27H22ClFN2O5
Mol. Mass.:
508.925
SMILES:
O[C@H](C[C@@H](Cc1ccc(cc1)-c1cccc(Cl)c1)NC(=O)c1cc(no1)-c1ccccc1F)C(O)=O
: