Target
cAMP and cAMP-inhibited cGMP 3',5'-cyclic phosphodiesterase 10A
Ligand
BDBM304041
Substrate
Meas. Tech.
Assay of Phosphodiesterase 10 Inhibition In Vitro
IC50
413±n/a nM
Citation
 Moszczynski-Petkowski, RBojarski, LWieczorek, MMajer, JJanowska, SMatloka, MBorkowska, MStefaniak, FLamparska-Przybysz, MDubiel, K Fused triazole derivatives as phosphodiesterase 10A inhibitors US Patent  US10138245 Publication Date 11/27/2018 
Target
Name:
cAMP and cAMP-inhibited cGMP 3',5'-cyclic phosphodiesterase 10A
Synonyms:
3',5'-cyclic phosphodiesterase PDE10_HUMAN Phosphodiesterase 10A
Type:
Protein
Mol. Mass.:
88412.52
Organism:
Homo sapiens (Human)
Description:
Q9Y233
Residue:
779
  
Inhibitor
Name:
BDBM304041
Synonyms:
US10138245, Example 48B
Type:
Small organic molecule
Emp. Form.:
C21H18N6
Mol. Mass.:
354.4078
SMILES:
Cc1cc(C)n2nc(nc2n1)-c1ccc2nc(-c3ccccc3)n(C)c2c1
: