Target
CDK-activating kinase assembly factor MAT1/Cyclin-H/Cyclin-dependent kinase 7
Ligand
BDBM530414
Substrate
Meas. Tech.
n Vitro CDK7 (5 nM) Assay
IC50
5.37±n/a nM
Citation
 Anne, MLSophie, CÉPascal, ACEddy, LYChristophe, M CYCLIN-DEPENDENT KINASE 7 (CDK7) NON-COVALENT INHIBITORS WIPO 0:0 (2022) Target
Name:
CDK-activating kinase assembly factor MAT1/Cyclin-H/Cyclin-dependent kinase 7
Synonyms:
CDK-activating kinase assembly factor MAT1/Cyclin H/Cyclin-dependent kinase 7 | CDK7/Cyclin H/MNAT1
Type:
Protein
Mol. Mass.:
Description:
Components:
This complex has 3 components.
Component 1
Name:
Cyclin-dependent kinase 7
Synonyms:
39 kDa protein kinase CAK1 CDK-activating kinase 1 (CAK) CDK7_HUMAN Cell division protein kinase 7 Cyclin-dependent kinase 7 (CDK7/cyclin H) P39 Mo15 TFIIH basal transcription factor complex kinase subunit
Type:
Enzyme Subunit
Mol. Mass.:
39047.01
Organism:
Homo sapiens (Human)
Description:
Residue:
346
  
Component 2
Name:
Cyclin-H
Synonyms:
CCNH Cyclin H p34 | p37
Type:
Enzyme Subunit
Mol. Mass.:
37646.05
Organism:
Homo sapiens (Human)
Description:
Residue:
323
  
Component 3
Name:
CDK-activating kinase assembly factor MAT1
Synonyms:
CAP35 Cyclin-G1-interacting protein MAT1_HUMAN Menage a trois RING finger protein MAT1 p35 | p36
Type:
Enzyme
Mol. Mass.:
35820.03
Organism:
Homo sapiens (Human)
Description:
P51948
Residue:
309
  
Inhibitor
Name:
BDBM530414
Synonyms:
WO2022064009, Compound 203
Type:
Small organic molecule
Emp. Form.:
C26H31N7O
Mol. Mass.:
457.5706
SMILES:
CN1CC[C@@H]([C@H](C1)c1cccc(C)c1)C(=O)N1Cc2nc(Nc3cnn(C)c3)ncc2[C@@H]2C[C@H]12
: