Target
Dihydroorotate dehydrogenase (quinone), mitochondrial
Ligand
BDBM530434
Substrate
Meas. Tech.
DHODH enzymatic assay
IC50
1.70±n/a nM
Citation
 Lindsey, DScott, KZhuming, Z DIHYDROOROTATE DEHYDROGENASE INHIBITORS WIPO 0:0 (2022) Target
Name:
Dihydroorotate dehydrogenase (quinone), mitochondrial
Synonyms:
DHODH Dihydroorotate dehydrogenase Dihydroorotate dehydrogenase, mitochondrial Dihydroorotate oxidase (DHODH) | PYRD_HUMAN
Type:
Enzyme
Mol. Mass.:
42881.33
Organism:
Homo sapiens (Human)
Description:
Q02127
Residue:
395
  
Inhibitor
Name:
BDBM530434
Synonyms:
6-(5-Acetyl-1-methyl-1H-1,2,4-triazol-3-yl)-7-fluoro-4-isopropyl-2-(o- tolyl)isoquinolin-1(2H)-one. | WO2022070068, Example 6
Type:
Small organic molecule
Emp. Form.:
C24H23FN4O2
Mol. Mass.:
418.4634
SMILES:
CC(C)c1cn(-c2ccccc2C)c(=O)c2cc(F)c(cc12)-c1nc(C(C)=O)n(C)n1
: