Target
Dihydroorotate dehydrogenase (quinone), mitochondrial
Ligand
BDBM530440
Substrate
Meas. Tech.
DHODH enzymatic assay
IC50
1.60±n/a nM
Citation
 Lindsey, DScott, KZhuming, Z DIHYDROOROTATE DEHYDROGENASE INHIBITORS WIPO 0:0 (2022) Target
Name:
Dihydroorotate dehydrogenase (quinone), mitochondrial
Synonyms:
DHODH Dihydroorotate dehydrogenase Dihydroorotate dehydrogenase, mitochondrial Dihydroorotate oxidase (DHODH) | PYRD_HUMAN
Type:
Enzyme
Mol. Mass.:
42881.33
Organism:
Homo sapiens (Human)
Description:
Q02127
Residue:
395
  
Inhibitor
Name:
BDBM530440
Synonyms:
(R*)-7-Fluoro-6-(5-(1-hydroxyethyl)-1-methyl-1H-1,2,4-triazol-3-yl)-4-isopropyl- 2-(o-tolyl)isoquinolin-1(2H)-one. WO2022070068, Example 21
Type:
Small organic molecule
Emp. Form.:
C24H25FN4O2
Mol. Mass.:
420.4793
SMILES:
CC(C)c1cn(-c2ccccc2C)c(=O)c2cc(F)c(cc12)-c1nc([C@@H](C)O)n(C)n1
: