Target
Dihydroorotate dehydrogenase (quinone), mitochondrial
Ligand
BDBM530468
Substrate
Meas. Tech.
DHODH enzymatic assay
IC50
4.07±n/a nM
Citation
 Lindsey, DScott, K DIHYDROOROTATE DEHYDROGENASE INHIBITORS WIPO 0:0 (2022) Target
Name:
Dihydroorotate dehydrogenase (quinone), mitochondrial
Synonyms:
DHODH Dihydroorotate dehydrogenase Dihydroorotate dehydrogenase, mitochondrial Dihydroorotate oxidase (DHODH) | PYRD_HUMAN
Type:
Enzyme
Mol. Mass.:
42881.33
Organism:
Homo sapiens (Human)
Description:
Q02127
Residue:
395
  
Inhibitor
Name:
BDBM530468
Synonyms:
7-Fluoro-8-(2-(2-hydroxypropan-2-yl)-1-methyl-1H-imidazol-4-yl)-1-isopropyl-3- (3-methyl-5-(trifluoromethyl)-1H-pyrazol-4-yl)-4H-quinolizin-4-one. | WO2022070071, Example 6
Type:
Small organic molecule
Emp. Form.:
C24H25F4N5O2
Mol. Mass.:
491.4812
SMILES:
CC(C)c1cc(-c2c(C)n[nH]c2C(F)(F)F)c(=O)n2cc(F)c(cc12)-c1cn(C)c(n1)C(C)(C)O
: