Target
N-formyl peptide receptor 2
Ligand
BDBM530472
Substrate
EC50
200±n/a nM
Citation
 L., PHA., JJV., DS AMINOIMIDAZOLE FPR2 AGONISTS WIPO 0:0 (2022) Target
Name:
N-formyl peptide receptor 2
Synonyms:
ALXR, FPRL1, FPR2 FPR2 FPRH1 Formyl Peptide Receptor-Like 1 LXA4 receptor Lipoxin A4 receptor RFP | hFPRL
Type:
G Protein-Coupled Receptor (GPCR)
Mol. Mass.:
38968.35
Organism:
Homo sapiens (Human)
Description:
P25090
Residue:
351
  
Inhibitor
Name:
BDBM530472
Synonyms:
N-[l-(2,6-Difluoro-4-methoxyphenyl)-4-phenyl-1H-imidazol-2-yl]-4-(difluoromethoxy)benzamide | WO2022076764, Example 1
Type:
Small organic molecule
Emp. Form.:
C24H17F4N3O3
Mol. Mass.:
471.4037
SMILES:
COc1cc(F)c(c(F)c1)-n1cc(nc1NC(=O)c1ccc(OC(F)F)cc1)-c1ccccc1
: