Target
fMet-Leu-Phe receptor
Ligand
BDBM530474
Substrate
EC50
8.00±n/a nM
Citation
 L., PHA., JJV., DS AMINOIMIDAZOLE FPR2 AGONISTS WIPO 0:0 (2022) Target
Name:
fMet-Leu-Phe receptor
Synonyms:
FPR FPR1_HUMAN N-formyl peptide receptor 1 fMLP receptor formyl peptide receptor 1
Type:
Enzyme Catalytic Domain
Mol. Mass.:
38456.14
Organism:
Homo sapiens (Human)
Description:
gi_4503779
Residue:
350
  
Inhibitor
Name:
BDBM530474
Synonyms:
WO2022076764, Example 3
Type:
Small organic molecule
Emp. Form.:
C25H19F4N3O4
Mol. Mass.:
501.4297
SMILES:
COc1cccc(c1)-c1cn(c(NC(=O)c2ccc(OC(F)F)cc2)n1)-c1c(F)cc(OC)cc1F
: