Target
N-formyl peptide receptor 2
Ligand
BDBM530485
Substrate
EC50
160±n/a nM
Citation
 L., PHA., JJV., DS AMINOIMIDAZOLE FPR2 AGONISTS WIPO 0:0 (2022) Target
Name:
N-formyl peptide receptor 2
Synonyms:
ALXR, FPRL1, FPR2 FPR2 FPRH1 Formyl Peptide Receptor-Like 1 LXA4 receptor Lipoxin A4 receptor RFP | hFPRL
Type:
G Protein-Coupled Receptor (GPCR)
Mol. Mass.:
38968.35
Organism:
Homo sapiens (Human)
Description:
P25090
Residue:
351
  
Inhibitor
Name:
BDBM530485
Synonyms:
WO2022076764, Example 14
Type:
Small organic molecule
Emp. Form.:
C25H19F4N3O4
Mol. Mass.:
501.4297
SMILES:
COc1ccc(cc1)-c1cn(c(NC(=O)c2ccc(OC(F)F)cc2)n1)-c1c(F)cc(OC)cc1F
: