Target
N-formyl peptide receptor 2
Ligand
BDBM530497
Substrate
EC50
400±n/a nM
Citation
 L., PHA., JJV., DS AMINOIMIDAZOLE FPR2 AGONISTS WIPO 0:0 (2022) Target
Name:
N-formyl peptide receptor 2
Synonyms:
ALXR, FPRL1, FPR2 FPR2 FPRH1 Formyl Peptide Receptor-Like 1 LXA4 receptor Lipoxin A4 receptor RFP | hFPRL
Type:
G Protein-Coupled Receptor (GPCR)
Mol. Mass.:
38968.35
Organism:
Homo sapiens (Human)
Description:
P25090
Residue:
351
  
Inhibitor
Name:
BDBM530497
Synonyms:
WO2022076764, Example 26
Type:
Small organic molecule
Emp. Form.:
C25H17ClF2N4O4
Mol. Mass.:
510.877
SMILES:
COc1ccc(cc1)-n1cc(nc1NC(=O)c1ccc(OC(F)F)cc1)-c1nc2cc(Cl)ccc2o1
: