Target
fMet-Leu-Phe receptor
Ligand
BDBM530506
Substrate
EC50
99±n/a nM
Citation
 L., PHA., JJV., DS AMINOIMIDAZOLE FPR2 AGONISTS WIPO 0:0 (2022) Target
Name:
fMet-Leu-Phe receptor
Synonyms:
FPR FPR1_HUMAN N-formyl peptide receptor 1 fMLP receptor formyl peptide receptor 1
Type:
Enzyme Catalytic Domain
Mol. Mass.:
38456.14
Organism:
Homo sapiens (Human)
Description:
gi_4503779
Residue:
350
  
Inhibitor
Name:
BDBM530506
Synonyms:
WO2022076764, Example 35
Type:
Small organic molecule
Emp. Form.:
C22H21F4N3O3
Mol. Mass.:
451.4141
SMILES:
COc1cc(F)c(c(F)c1)-n1cc(CC(C)C)nc1NC(=O)c1ccc(OC(F)F)cc1
: