Target
N-formyl peptide receptor 2
Ligand
BDBM530522
Substrate
EC50
2900±n/a nM
Citation
 L., PHA., JJV., DS AMINOIMIDAZOLE FPR2 AGONISTS WIPO 0:0 (2022) Target
Name:
N-formyl peptide receptor 2
Synonyms:
ALXR, FPRL1, FPR2 FPR2 FPRH1 Formyl Peptide Receptor-Like 1 LXA4 receptor Lipoxin A4 receptor RFP | hFPRL
Type:
G Protein-Coupled Receptor (GPCR)
Mol. Mass.:
38968.35
Organism:
Homo sapiens (Human)
Description:
P25090
Residue:
351
  
Inhibitor
Name:
BDBM530522
Synonyms:
WO2022076764, Example 51
Type:
Small organic molecule
Emp. Form.:
C24H22F4N4O5
Mol. Mass.:
522.4489
SMILES:
COc1cc(F)c(c(F)c1)-n1cc(nc1NC(=O)c1ccc(OC(F)F)cc1)C(=O)N1CCCC(O)C1
: