Target
N-formyl peptide receptor 2
Ligand
BDBM530536
Substrate
EC50
320±n/a nM
Citation
 L., PHA., JJV., DS AMINOIMIDAZOLE FPR2 AGONISTS WIPO 0:0 (2022) Target
Name:
N-formyl peptide receptor 2
Synonyms:
ALXR, FPRL1, FPR2 FPR2 FPRH1 Formyl Peptide Receptor-Like 1 LXA4 receptor Lipoxin A4 receptor RFP | hFPRL
Type:
G Protein-Coupled Receptor (GPCR)
Mol. Mass.:
38968.35
Organism:
Homo sapiens (Human)
Description:
P25090
Residue:
351
  
Inhibitor
Name:
BDBM530536
Synonyms:
N-[l-(2,6-Difluoro-4-methoxyphenyl)-4-[l-(ethanesulfonyl)piperidin-4-yl]-1H-imidazol-2-y 1 ]-4-(difluoromethoxy )b enzami de | WO2022076764, Example 65
Type:
Small organic molecule
Emp. Form.:
C25H26F4N4O5S
Mol. Mass.:
570.556
SMILES:
CCS(=O)(=O)N1CCC(CC1)c1cn(c(NC(=O)c2ccc(OC(F)F)cc2)n1)-c1c(F)cc(OC)cc1F
: