Target
fMet-Leu-Phe receptor
Ligand
BDBM530552
Substrate
EC50
4.00±n/a nM
Citation
 L., PHA., JJV., DS AMINOIMIDAZOLE FPR2 AGONISTS WIPO 0:0 (2022) Target
Name:
fMet-Leu-Phe receptor
Synonyms:
FPR FPR1_HUMAN N-formyl peptide receptor 1 fMLP receptor formyl peptide receptor 1
Type:
Enzyme Catalytic Domain
Mol. Mass.:
38456.14
Organism:
Homo sapiens (Human)
Description:
gi_4503779
Residue:
350
  
Inhibitor
Name:
BDBM530552
Synonyms:
WO2022076764, Example 81
Type:
Small organic molecule
Emp. Form.:
C22H20F4N4O3
Mol. Mass.:
464.4128
SMILES:
COc1cc(F)c(c(F)c1)-n1cc(nc1NC(=O)c1ccc(OC(F)F)cc1)C1CC(N)C1
: