Target
N-formyl peptide receptor 2
Ligand
BDBM530554
Substrate
EC50
400±n/a nM
Citation
 L., PHA., JJV., DS AMINOIMIDAZOLE FPR2 AGONISTS WIPO 0:0 (2022) Target
Name:
N-formyl peptide receptor 2
Synonyms:
ALXR, FPRL1, FPR2 FPR2 FPRH1 Formyl Peptide Receptor-Like 1 LXA4 receptor Lipoxin A4 receptor RFP | hFPRL
Type:
G Protein-Coupled Receptor (GPCR)
Mol. Mass.:
38968.35
Organism:
Homo sapiens (Human)
Description:
P25090
Residue:
351
  
Inhibitor
Name:
BDBM530554
Synonyms:
N-[l-(2,6-Ddifluoro-4-methoxyphenyl)-4-(3-methanesulfonamidocyclobutyl)-1H-imidazol-2-yl]-4-(difluorom ethoxy )benzamide | WO2022076764, Example 83
Type:
Small organic molecule
Emp. Form.:
C23H22F4N4O5S
Mol. Mass.:
542.503
SMILES:
COc1cc(F)c(c(F)c1)-n1cc(nc1NC(=O)c1ccc(OC(F)F)cc1)C1CC(C1)NS(C)(=O)=O
: