Target
Diacylglycerol O-acyltransferase 2
Ligand
BDBM530570
Substrate
Meas. Tech.
DGAT2 enzymatic activity assay
IC50
32±n/a nM
Citation
 Yeon-Hee, LR., AEJianming, BChen, CP., RJHelen, SE PREPARATION OF BENZIMIDAZOLONE DERIVATIVES AS NOVEL DIACYLGLYCERIDE O-ACYLTRANSFERASE 2 INHIBITORS WIPO 0:0 (2022) Target
Name:
Diacylglycerol O-acyltransferase 2
Synonyms:
ARAT DGAT2 Diacylglycerol O-acyltransferase 2 (DGAT2) Retinol O-fatty-acyltransferase
Type:
Multi-pass membrane protein
Mol. Mass.:
43848.90
Organism:
Homo sapiens (Human)
Description:
Q96PD7
Residue:
388
  
Inhibitor
Name:
BDBM530570
Synonyms:
WO2022076495, EXAMPLE 16 | WO2022076495, EXAMPLE 21
Type:
Small organic molecule
Emp. Form.:
C22H25FN4O5S
Mol. Mass.:
476.521
SMILES:
CCOc1cc(c(F)cn1)-n1c2ccc(cc2n(C(C)C)c1=O)C(=O)NC1(C)CS(=O)(=O)C1
: