Target
Diacylglycerol O-acyltransferase 2
Ligand
BDBM530607
Substrate
Meas. Tech.
DGAT2 enzymatic activity assay
IC50
251±n/a nM
Citation
 Yeon-Hee, LR., AEJianming, BChen, CP., RJHelen, SE PREPARATION OF BENZIMIDAZOLONE DERIVATIVES AS NOVEL DIACYLGLYCERIDE O-ACYLTRANSFERASE 2 INHIBITORS WIPO 0:0 (2022) Target
Name:
Diacylglycerol O-acyltransferase 2
Synonyms:
ARAT DGAT2 Diacylglycerol O-acyltransferase 2 (DGAT2) Retinol O-fatty-acyltransferase
Type:
Multi-pass membrane protein
Mol. Mass.:
43848.90
Organism:
Homo sapiens (Human)
Description:
Q96PD7
Residue:
388
  
Inhibitor
Name:
BDBM530607
Synonyms:
WO2022076495, EXAMPLE 51
Type:
Small organic molecule
Emp. Form.:
C25H31FN4O5S
Mol. Mass.:
518.601
SMILES:
CC(C)Oc1cc(c(F)cn1)-n1c2ccc(cc2n(C(C)C)c1=O)C(=O)NC1(C)CCS(=O)(=O)CC1
: