Target
Diacylglycerol O-acyltransferase 2
Ligand
BDBM530609
Substrate
Meas. Tech.
DGAT2 enzymatic activity assay
IC50
1834±n/a nM
Citation
 Yeon-Hee, LR., AEJianming, BChen, CP., RJHelen, SE PREPARATION OF BENZIMIDAZOLONE DERIVATIVES AS NOVEL DIACYLGLYCERIDE O-ACYLTRANSFERASE 2 INHIBITORS WIPO 0:0 (2022) Target
Name:
Diacylglycerol O-acyltransferase 2
Synonyms:
ARAT DGAT2 Diacylglycerol O-acyltransferase 2 (DGAT2) Retinol O-fatty-acyltransferase
Type:
Multi-pass membrane protein
Mol. Mass.:
43848.90
Organism:
Homo sapiens (Human)
Description:
Q96PD7
Residue:
388
  
Inhibitor
Name:
BDBM530609
Synonyms:
WO2022076495, EXAMPLE 53
Type:
Small organic molecule
Emp. Form.:
C24H26F3N3O4S
Mol. Mass.:
509.541
SMILES:
CC(C)n1c2cc(ccc2n(-c2cccc(c2)C(F)(F)F)c1=O)C(=O)NC1(C)CCS(=O)(=O)CC1
: