Target
Diacylglycerol O-acyltransferase 2
Ligand
BDBM530625
Substrate
Meas. Tech.
DGAT2 enzymatic activity assay
IC50
211±n/a nM
Citation
 Yeon-Hee, LR., AEJianming, BChen, CP., RJHelen, SE PREPARATION OF BENZIMIDAZOLONE DERIVATIVES AS NOVEL DIACYLGLYCERIDE O-ACYLTRANSFERASE 2 INHIBITORS WIPO 0:0 (2022) Target
Name:
Diacylglycerol O-acyltransferase 2
Synonyms:
ARAT DGAT2 Diacylglycerol O-acyltransferase 2 (DGAT2) Retinol O-fatty-acyltransferase
Type:
Multi-pass membrane protein
Mol. Mass.:
43848.90
Organism:
Homo sapiens (Human)
Description:
Q96PD7
Residue:
388
  
Inhibitor
Name:
BDBM530625
Synonyms:
WO2022076495, EXAMPLE 67b
Type:
Small organic molecule
Emp. Form.:
C26H31F2N3O6S
Mol. Mass.:
551.603
SMILES:
C[C@@H](n1c2cc(ccc2n(-c2cccc(OC(F)F)c2)c1=O)C(=O)NC1(C)CCS(=O)(=O)CC1)C(C)(C)O
: