Target
Diacylglycerol O-acyltransferase 2
Ligand
BDBM530630
Substrate
Meas. Tech.
DGAT2 enzymatic activity assay
IC50
1.00±n/a nM
Citation
 Yeon-Hee, LR., AEJianming, BChen, CP., RJHelen, SE PREPARATION OF BENZIMIDAZOLONE DERIVATIVES AS NOVEL DIACYLGLYCERIDE O-ACYLTRANSFERASE 2 INHIBITORS WIPO 0:0 (2022) Target
Name:
Diacylglycerol O-acyltransferase 2
Synonyms:
ARAT DGAT2 Diacylglycerol O-acyltransferase 2 (DGAT2) Retinol O-fatty-acyltransferase
Type:
Multi-pass membrane protein
Mol. Mass.:
43848.90
Organism:
Homo sapiens (Human)
Description:
Q96PD7
Residue:
388
  
Inhibitor
Name:
BDBM530630
Synonyms:
WO2022076495, EXAMPLE 70a
Type:
Small organic molecule
Emp. Form.:
C26H28F5N3O6S
Mol. Mass.:
605.574
SMILES:
C[C@H](n1c2cc(C(=O)NC3(C)CCS(=O)(=O)CC3)c(F)cc2n(-c2cc(OC(F)(F)F)ccc2F)c1=O)C(C)(C)O
: