Target
Diacylglycerol O-acyltransferase 2
Ligand
BDBM530635
Substrate
Meas. Tech.
DGAT2 enzymatic activity assay
IC50
6.60±n/a nM
Citation
 Yeon-Hee, LR., AEJianming, BChen, CP., RJHelen, SE PREPARATION OF BENZIMIDAZOLONE DERIVATIVES AS NOVEL DIACYLGLYCERIDE O-ACYLTRANSFERASE 2 INHIBITORS WIPO 0:0 (2022) Target
Name:
Diacylglycerol O-acyltransferase 2
Synonyms:
ARAT DGAT2 Diacylglycerol O-acyltransferase 2 (DGAT2) Retinol O-fatty-acyltransferase
Type:
Multi-pass membrane protein
Mol. Mass.:
43848.90
Organism:
Homo sapiens (Human)
Description:
Q96PD7
Residue:
388
  
Inhibitor
Name:
BDBM530635
Synonyms:
WO2022076495, EXAMPLE 72b
Type:
Small organic molecule
Emp. Form.:
C26H31F3N4O6S
Mol. Mass.:
584.608
SMILES:
C[C@@H](n1c2cc(ccc2n(-c2cc(OCC(F)F)ncc2F)c1=O)C(=O)NC1(C)CCS(=O)(=O)CC1)C(C)(C)O
: