Target
Diacylglycerol O-acyltransferase 2
Ligand
BDBM530647
Substrate
Meas. Tech.
DGAT2 enzymatic activity assay
IC50
13±n/a nM
Citation
 Yeon-Hee, LR., AEJianming, BChen, CP., RJHelen, SE PREPARATION OF BENZIMIDAZOLONE DERIVATIVES AS NOVEL DIACYLGLYCERIDE O-ACYLTRANSFERASE 2 INHIBITORS WIPO 0:0 (2022) Target
Name:
Diacylglycerol O-acyltransferase 2
Synonyms:
ARAT DGAT2 Diacylglycerol O-acyltransferase 2 (DGAT2) Retinol O-fatty-acyltransferase
Type:
Multi-pass membrane protein
Mol. Mass.:
43848.90
Organism:
Homo sapiens (Human)
Description:
Q96PD7
Residue:
388
  
Inhibitor
Name:
BDBM530647
Synonyms:
WO2022076495, EXAMPLE 78b
Type:
Small organic molecule
Emp. Form.:
C24H29FN4O6S
Mol. Mass.:
520.574
SMILES:
CCOc1cc(c(F)cn1)-n1c2ccc(cc2n([C@@H](C)C(C)(C)O)c1=O)C(=O)NC1(C)CS(=O)(=O)C1
: