Target
Diacylglycerol O-acyltransferase 2
Ligand
BDBM530653
Substrate
Meas. Tech.
DGAT2 enzymatic activity assay
IC50
71±n/a nM
Citation
 Yeon-Hee, LR., AEJianming, BChen, CP., RJHelen, SE PREPARATION OF BENZIMIDAZOLONE DERIVATIVES AS NOVEL DIACYLGLYCERIDE O-ACYLTRANSFERASE 2 INHIBITORS WIPO 0:0 (2022) Target
Name:
Diacylglycerol O-acyltransferase 2
Synonyms:
ARAT DGAT2 Diacylglycerol O-acyltransferase 2 (DGAT2) Retinol O-fatty-acyltransferase
Type:
Multi-pass membrane protein
Mol. Mass.:
43848.90
Organism:
Homo sapiens (Human)
Description:
Q96PD7
Residue:
388
  
Inhibitor
Name:
BDBM530653
Synonyms:
WO2022076495, EXAMPLE 84
Type:
Small organic molecule
Emp. Form.:
C23H26N4O4S
Mol. Mass.:
454.542
SMILES:
CC(C)n1c2cc(ccc2n(-c2cncc(c2)C2CC2)c1=O)C(=O)NC1(C)CS(=O)(=O)C1
: