Target
Diacylglycerol O-acyltransferase 2
Ligand
BDBM530654
Substrate
Meas. Tech.
DGAT2 enzymatic activity assay
IC50
1752±n/a nM
Citation
 Yeon-Hee, LR., AEJianming, BChen, CP., RJHelen, SE PREPARATION OF BENZIMIDAZOLONE DERIVATIVES AS NOVEL DIACYLGLYCERIDE O-ACYLTRANSFERASE 2 INHIBITORS WIPO 0:0 (2022) Target
Name:
Diacylglycerol O-acyltransferase 2
Synonyms:
ARAT DGAT2 Diacylglycerol O-acyltransferase 2 (DGAT2) Retinol O-fatty-acyltransferase
Type:
Multi-pass membrane protein
Mol. Mass.:
43848.90
Organism:
Homo sapiens (Human)
Description:
Q96PD7
Residue:
388
  
Inhibitor
Name:
BDBM530654
Synonyms:
3-(1-amino-1-oxopropan-2-yl)-1-(3-(difluoromethoxy)phenyl)-N-(4-methyl-1,1-dioxidotetrahydro-2H-thiopyran-4-yl)-2-oxo-2,3-dihydro-1H-benzo[d]imidazole-5-carboxamide | WO2022076495, EXAMPLE 85
Type:
Small organic molecule
Emp. Form.:
C24H26F2N4O6S
Mol. Mass.:
536.548
SMILES:
CC(C(N)=O)n1c2cc(ccc2n(-c2cccc(OC(F)F)c2)c1=O)C(=O)NC1(C)CCS(=O)(=O)CC1
: