Target
Diacylglycerol O-acyltransferase 2
Ligand
BDBM530673
Substrate
Meas. Tech.
DGAT2 enzymatic activity assay
IC50
94±n/a nM
Citation
 Yeon-Hee, LR., AEJianming, BChen, CP., RJHelen, SE PREPARATION OF BENZIMIDAZOLONE DERIVATIVES AS NOVEL DIACYLGLYCERIDE O-ACYLTRANSFERASE 2 INHIBITORS WIPO 0:0 (2022) Target
Name:
Diacylglycerol O-acyltransferase 2
Synonyms:
ARAT DGAT2 Diacylglycerol O-acyltransferase 2 (DGAT2) Retinol O-fatty-acyltransferase
Type:
Multi-pass membrane protein
Mol. Mass.:
43848.90
Organism:
Homo sapiens (Human)
Description:
Q96PD7
Residue:
388
  
Inhibitor
Name:
BDBM530673
Synonyms:
WO2022076495, EXAMPLE 104
Type:
Small organic molecule
Emp. Form.:
C21H22F2N4O5S
Mol. Mass.:
480.485
SMILES:
CC(C)n1c2cc(cnc2n(-c2cccc(OC(F)F)c2)c1=O)C(=O)NC1(C)CS(=O)(=O)C1
: