Target
Diacylglycerol O-acyltransferase 2
Ligand
BDBM530682
Substrate
Meas. Tech.
DGAT2 enzymatic activity assay
IC50
78±n/a nM
Citation
 Yeon-Hee, LR., AEJianming, BChen, CP., RJHelen, SE PREPARATION OF BENZIMIDAZOLONE DERIVATIVES AS NOVEL DIACYLGLYCERIDE O-ACYLTRANSFERASE 2 INHIBITORS WIPO 0:0 (2022) Target
Name:
Diacylglycerol O-acyltransferase 2
Synonyms:
ARAT DGAT2 Diacylglycerol O-acyltransferase 2 (DGAT2) Retinol O-fatty-acyltransferase
Type:
Multi-pass membrane protein
Mol. Mass.:
43848.90
Organism:
Homo sapiens (Human)
Description:
Q96PD7
Residue:
388
  
Inhibitor
Name:
BDBM530682
Synonyms:
WO2022076495, EXAMPLE 113
Type:
Small organic molecule
Emp. Form.:
C23H24F3N3O5S
Mol. Mass.:
511.514
SMILES:
CC(C)n1c2cc(C(=O)N[C@]3(C)CCS(=O)(=O)C3)c(F)cc2n(-c2cccc(OC(F)F)c2)c1=O
: