Target
Diacylglycerol O-acyltransferase 2
Ligand
BDBM530684
Substrate
Meas. Tech.
DGAT2 enzymatic activity assay
IC50
4.10±n/a nM
Citation
 Yeon-Hee, LR., AEJianming, BChen, CP., RJHelen, SE PREPARATION OF BENZIMIDAZOLONE DERIVATIVES AS NOVEL DIACYLGLYCERIDE O-ACYLTRANSFERASE 2 INHIBITORS WIPO 0:0 (2022) Target
Name:
Diacylglycerol O-acyltransferase 2
Synonyms:
ARAT DGAT2 Diacylglycerol O-acyltransferase 2 (DGAT2) Retinol O-fatty-acyltransferase
Type:
Multi-pass membrane protein
Mol. Mass.:
43848.90
Organism:
Homo sapiens (Human)
Description:
Q96PD7
Residue:
388
  
Inhibitor
Name:
BDBM530684
Synonyms:
WO2022076495, EXAMPLE 115 | l-(2-(2,2-difluoroethoxy)-5-fluoropyridin-4-yl)-6-fluoro-3-isopropyl-N-(4-methyl-1,1-dioxidotetrahydro-2H-thiopyran-4-yl)-2-oxo-2,3-dihydro--be1Hnzo[d]imidazole-5-carboxamide
Type:
Small organic molecule
Emp. Form.:
C23H24F4N4O5S
Mol. Mass.:
544.519
SMILES:
CC(C)n1c2cc(C(=O)NC3(C)CCS(=O)(=O)CC3)c(F)cc2n(-c2cc(OC(F)F)ncc2F)c1=O
: