Target
Diacylglycerol O-acyltransferase 2
Ligand
BDBM530560
Substrate
IC50
1093±n/a nM
Citation
 Yeon-Hee, LJianming, BP., RJYeon-Hee, LJianming, BP., RJ PREPARATION OF OXINDOLE DERIVATIVES AS NOVEL DIACYLGLYCERIDE O-ACYLTRANSFERASE 2 INHIBITORS WIPO 0:0 (2022) Target
Name:
Diacylglycerol O-acyltransferase 2
Synonyms:
ARAT DGAT2 Diacylglycerol O-acyltransferase 2 (DGAT2) Retinol O-fatty-acyltransferase
Type:
Multi-pass membrane protein
Mol. Mass.:
43848.90
Organism:
Homo sapiens (Human)
Description:
Q96PD7
Residue:
388
  
Inhibitor
Name:
BDBM530560
Synonyms:
WO2022076495, EXAMPLE 12 | WO2022076495, EXAMPLE 6
Type:
Small organic molecule
Emp. Form.:
C22H23F2N3O5S
Mol. Mass.:
479.497
SMILES:
CC(C)n1c2cc(ccc2n(-c2cccc(OC(F)F)c2)c1=O)C(=O)NC1(C)CS(=O)(=O)C1
: