Target
Diacylglycerol O-acyltransferase 2
Ligand
BDBM530701
Substrate
IC50
29±n/a nM
Citation
 Yeon-Hee, LJianming, BP., RJYeon-Hee, LJianming, BP., RJ PREPARATION OF OXINDOLE DERIVATIVES AS NOVEL DIACYLGLYCERIDE O-ACYLTRANSFERASE 2 INHIBITORS WIPO 0:0 (2022) Target
Name:
Diacylglycerol O-acyltransferase 2
Synonyms:
ARAT DGAT2 Diacylglycerol O-acyltransferase 2 (DGAT2) Retinol O-fatty-acyltransferase
Type:
Multi-pass membrane protein
Mol. Mass.:
43848.90
Organism:
Homo sapiens (Human)
Description:
Q96PD7
Residue:
388
  
Inhibitor
Name:
BDBM530701
Synonyms:
1-(3-(difluoromethoxy)phenyl)-3,3-dimethyl-N-(3-methyl-1,1-dioxidothietan-3-yl)-2-oxoindoline-5-carboxamide | WO2022076496, Example 3
Type:
Small organic molecule
Emp. Form.:
C22H22F2N2O5S
Mol. Mass.:
464.482
SMILES:
CC1(CS(=O)(=O)C1)NC(=O)c1ccc2N(C(=O)C(C)(C)c2c1)c1cccc(OC(F)F)c1
: