Target
Diacylglycerol O-acyltransferase 2
Ligand
BDBM530708
Substrate
IC50
2950±n/a nM
Citation
 Yeon-Hee, LJianming, BP., RJYeon-Hee, LJianming, BP., RJ PREPARATION OF OXINDOLE DERIVATIVES AS NOVEL DIACYLGLYCERIDE O-ACYLTRANSFERASE 2 INHIBITORS WIPO 0:0 (2022) Target
Name:
Diacylglycerol O-acyltransferase 2
Synonyms:
ARAT DGAT2 Diacylglycerol O-acyltransferase 2 (DGAT2) Retinol O-fatty-acyltransferase
Type:
Multi-pass membrane protein
Mol. Mass.:
43848.90
Organism:
Homo sapiens (Human)
Description:
Q96PD7
Residue:
388
  
Inhibitor
Name:
BDBM530708
Synonyms:
WO2022076496, Example 7b
Type:
Small organic molecule
Emp. Form.:
C21H17F5N2O6S
Mol. Mass.:
520.426
SMILES:
CC1(CS(=O)(=O)C1)NC(=O)c1ccc2N(C(=O)[C@@](O)(c2c1)C(F)(F)F)c1cccc(OC(F)F)c1
: