Target
Diacylglycerol O-acyltransferase 2
Ligand
BDBM530721
Substrate
IC50
13±n/a nM
Citation
 Yeon-Hee, LJianming, BP., RJYeon-Hee, LJianming, BP., RJ PREPARATION OF OXINDOLE DERIVATIVES AS NOVEL DIACYLGLYCERIDE O-ACYLTRANSFERASE 2 INHIBITORS WIPO 0:0 (2022) Target
Name:
Diacylglycerol O-acyltransferase 2
Synonyms:
ARAT DGAT2 Diacylglycerol O-acyltransferase 2 (DGAT2) Retinol O-fatty-acyltransferase
Type:
Multi-pass membrane protein
Mol. Mass.:
43848.90
Organism:
Homo sapiens (Human)
Description:
Q96PD7
Residue:
388
  
Inhibitor
Name:
BDBM530721
Synonyms:
WO2022076496, Example 19
Type:
Small organic molecule
Emp. Form.:
C24H25F3N2O5S
Mol. Mass.:
510.526
SMILES:
CC1(C)C(=O)N(c2ccc(cc12)C(=O)NC1(C)CCS(=O)(=O)CC1)c1cc(OC(F)F)ccc1F
: