Target
Diacylglycerol O-acyltransferase 2
Ligand
BDBM530727
Substrate
IC50
28±n/a nM
Citation
 Yeon-Hee, LJianming, BP., RJYeon-Hee, LJianming, BP., RJ PREPARATION OF OXINDOLE DERIVATIVES AS NOVEL DIACYLGLYCERIDE O-ACYLTRANSFERASE 2 INHIBITORS WIPO 0:0 (2022) Target
Name:
Diacylglycerol O-acyltransferase 2
Synonyms:
ARAT DGAT2 Diacylglycerol O-acyltransferase 2 (DGAT2) Retinol O-fatty-acyltransferase
Type:
Multi-pass membrane protein
Mol. Mass.:
43848.90
Organism:
Homo sapiens (Human)
Description:
Q96PD7
Residue:
388
  
Inhibitor
Name:
BDBM530727
Synonyms:
WO2022076496, Example 25
Type:
Small organic molecule
Emp. Form.:
C23H23F4N3O5S
Mol. Mass.:
529.504
SMILES:
C[C@@]1(CCS(=O)(=O)C1)NC(=O)c1ccc2N(C(=O)C(C)(C)c2c1)c1cncc(OC(F)(F)C(F)F)c1
: