Target
Diacylglycerol O-acyltransferase 2
Ligand
BDBM530732
Substrate
IC50
53±n/a nM
Citation
 Yeon-Hee, LJianming, BP., RJYeon-Hee, LJianming, BP., RJ PREPARATION OF OXINDOLE DERIVATIVES AS NOVEL DIACYLGLYCERIDE O-ACYLTRANSFERASE 2 INHIBITORS WIPO 0:0 (2022) Target
Name:
Diacylglycerol O-acyltransferase 2
Synonyms:
ARAT DGAT2 Diacylglycerol O-acyltransferase 2 (DGAT2) Retinol O-fatty-acyltransferase
Type:
Multi-pass membrane protein
Mol. Mass.:
43848.90
Organism:
Homo sapiens (Human)
Description:
Q96PD7
Residue:
388
  
Inhibitor
Name:
BDBM530732
Synonyms:
WO2022076496, Example 29 | WO2022076496, Example 30
Type:
Small organic molecule
Emp. Form.:
C23H26FN3O5S
Mol. Mass.:
475.533
SMILES:
CCOc1cc(N2C(=O)C(C)(C)c3cc(ccc23)C(=O)N[C@]2(C)CCS(=O)(=O)C2)c(F)cn1
: