Target
Diacylglycerol O-acyltransferase 2
Ligand
BDBM530772
Substrate
IC50
157±n/a nM
Citation
 Yeon-Hee, LJianming, BP., RJYeon-Hee, LJianming, BP., RJ PREPARATION OF OXINDOLE DERIVATIVES AS NOVEL DIACYLGLYCERIDE O-ACYLTRANSFERASE 2 INHIBITORS WIPO 0:0 (2022) Target
Name:
Diacylglycerol O-acyltransferase 2
Synonyms:
ARAT DGAT2 Diacylglycerol O-acyltransferase 2 (DGAT2) Retinol O-fatty-acyltransferase
Type:
Multi-pass membrane protein
Mol. Mass.:
43848.90
Organism:
Homo sapiens (Human)
Description:
Q96PD7
Residue:
388
  
Inhibitor
Name:
BDBM530772
Synonyms:
WO2022076496, Example 69
Type:
Small organic molecule
Emp. Form.:
C25H29N3O5S
Mol. Mass.:
483.58
SMILES:
CC1(C)C(=O)N(c2ccc(cc12)C(=O)NC1(C)CCS(=O)(=O)CC1)c1cc(OC2CC2)ccn1
: