Target
Diacylglycerol O-acyltransferase 2
Ligand
BDBM530805
Substrate
IC50
111±n/a nM
Citation
 Yeon-Hee, LJianming, BP., RJYeon-Hee, LJianming, BP., RJ PREPARATION OF OXINDOLE DERIVATIVES AS NOVEL DIACYLGLYCERIDE O-ACYLTRANSFERASE 2 INHIBITORS WIPO 0:0 (2022) Target
Name:
Diacylglycerol O-acyltransferase 2
Synonyms:
ARAT DGAT2 Diacylglycerol O-acyltransferase 2 (DGAT2) Retinol O-fatty-acyltransferase
Type:
Multi-pass membrane protein
Mol. Mass.:
43848.90
Organism:
Homo sapiens (Human)
Description:
Q96PD7
Residue:
388
  
Inhibitor
Name:
BDBM530805
Synonyms:
WO2022076496, Example 102
Type:
Small organic molecule
Emp. Form.:
C22H25N3O5S
Mol. Mass.:
443.516
SMILES:
CCOc1cncc(c1)N1C(=O)C(C)(C)c2cc(ccc12)C(=O)NC1(C)CS(=O)(=O)C1
: