Target
Diacylglycerol O-acyltransferase 2
Ligand
BDBM530850
Substrate
IC50
10±n/a nM
Citation
 Yeon-Hee, LJianming, BP., RJYeon-Hee, LJianming, BP., RJ PREPARATION OF OXINDOLE DERIVATIVES AS NOVEL DIACYLGLYCERIDE O-ACYLTRANSFERASE 2 INHIBITORS WIPO 0:0 (2022) Target
Name:
Diacylglycerol O-acyltransferase 2
Synonyms:
ARAT DGAT2 Diacylglycerol O-acyltransferase 2 (DGAT2) Retinol O-fatty-acyltransferase
Type:
Multi-pass membrane protein
Mol. Mass.:
43848.90
Organism:
Homo sapiens (Human)
Description:
Q96PD7
Residue:
388
  
Inhibitor
Name:
BDBM530850
Synonyms:
WO2022076496, Example 141
Type:
Small organic molecule
Emp. Form.:
C22H23F2N3O5S
Mol. Mass.:
479.497
SMILES:
CCOc1cc(N2C(=O)C(C)(C)c3cc(cc(F)c23)C(=O)NC2(C)CS(=O)(=O)C2)c(F)cn1
: