Target
Diacylglycerol O-acyltransferase 2
Ligand
BDBM530853
Substrate
IC50
2.30±n/a nM
Citation
 Yeon-Hee, LJianming, BP., RJYeon-Hee, LJianming, BP., RJ PREPARATION OF OXINDOLE DERIVATIVES AS NOVEL DIACYLGLYCERIDE O-ACYLTRANSFERASE 2 INHIBITORS WIPO 0:0 (2022) Target
Name:
Diacylglycerol O-acyltransferase 2
Synonyms:
ARAT DGAT2 Diacylglycerol O-acyltransferase 2 (DGAT2) Retinol O-fatty-acyltransferase
Type:
Multi-pass membrane protein
Mol. Mass.:
43848.90
Organism:
Homo sapiens (Human)
Description:
Q96PD7
Residue:
388
  
Inhibitor
Name:
BDBM530853
Synonyms:
WO2022076496, Example 144
Type:
Small organic molecule
Emp. Form.:
C24H27F2N3O5S
Mol. Mass.:
507.55
SMILES:
CCOc1cc(N2C(=O)C(C)(C)c3cc(cc(F)c23)C(=O)NC2(C)CCS(=O)(=O)CC2)c(F)cn1
: