Target
Diacylglycerol O-acyltransferase 2
Ligand
BDBM530858
Substrate
IC50
111±n/a nM
Citation
 Yeon-Hee, LJianming, BP., RJYeon-Hee, LJianming, BP., RJ PREPARATION OF OXINDOLE DERIVATIVES AS NOVEL DIACYLGLYCERIDE O-ACYLTRANSFERASE 2 INHIBITORS WIPO 0:0 (2022) Target
Name:
Diacylglycerol O-acyltransferase 2
Synonyms:
ARAT DGAT2 Diacylglycerol O-acyltransferase 2 (DGAT2) Retinol O-fatty-acyltransferase
Type:
Multi-pass membrane protein
Mol. Mass.:
43848.90
Organism:
Homo sapiens (Human)
Description:
Q96PD7
Residue:
388
  
Inhibitor
Name:
BDBM530858
Synonyms:
WO2022076496, Example 149
Type:
Small organic molecule
Emp. Form.:
C21H19F4N3O5S
Mol. Mass.:
501.451
SMILES:
CC1(CS(=O)(=O)C1)NC(=O)c1cc2c(N(C(=O)C2(C)C)c2cncc(OC(F)(F)F)c2)c(F)c1
: