Target
Lysocardiolipin acyltransferase 1
Ligand
BDBM532087
Substrate
Meas. Tech.
In Vitro Acyltransferase Assays
IC50
<35.0±n/a nM
Citation
 Shi, YChe, DBaell, JLiu, XFu, J Compounds useful as inhibitors of ALCAT 1 US Patent  US11208404 Publication Date 12/28/2021 
Target
Name:
Lysocardiolipin acyltransferase 1
Synonyms:
1-AGP acyltransferase 8 1-acylglycerol-3-phosphate O-acyltransferase 8 ALCAT1 LCLAT1 LYCAT
Type:
Protein
Mol. Mass.:
48934.23
Organism:
Human
Description:
Q6UWP7
Residue:
414
  
Inhibitor
Name:
BDBM532087
Synonyms:
US11208404, Compound 320
Type:
Small organic molecule
Emp. Form.:
C21H13F4N3O4
Mol. Mass.:
447.3392
SMILES:
FC(F)COc1ccc(F)cc1C(=O)Nc1cc(ccc1F)-c1nnc(o1)-c1ccco1
: