Target
Lysocardiolipin acyltransferase 1
Ligand
BDBM532060
Substrate
Meas. Tech.
In Vitro Acyltransferase Assays
IC50
33.0±n/a nM
Citation
 Shi, YChe, DBaell, JLiu, XFu, J Compounds useful as inhibitors of ALCAT 1 US Patent  US11208404 Publication Date 12/28/2021 
Target
Name:
Lysocardiolipin acyltransferase 1
Synonyms:
1-AGP acyltransferase 8 1-acylglycerol-3-phosphate O-acyltransferase 8 ALCAT1 LCLAT1 LYCAT
Type:
Protein
Mol. Mass.:
48934.23
Organism:
Human
Description:
Q6UWP7
Residue:
414
  
Inhibitor
Name:
BDBM532060
Synonyms:
US11208404, Compound 200
Type:
Small organic molecule
Emp. Form.:
C21H16IN3O4
Mol. Mass.:
501.2739
SMILES:
CCOc1ccc(I)cc1C(=O)Nc1cccc(c1)-c1nnc(o1)-c1ccco1
: