Target
Replicase polyprotein 1ab
Ligand
BDBM533523
Substrate
Meas. Tech.
MTase Filter-Binding Assay (FBA)
IC50
1010±200 nM
Citation
 Ahmed-Belkacem, RHausdorff, MDelpal, ASutto-Ortiz, PColmant, AMGTouret, FOgando, NSSnijder, EJCanard, BCoutard, BVasseur, JJDecroly, EDebart, F Potent Inhibition of SARS-CoV-2 nsp14  J Med Chem 65:6231-6249 (2022)  
Target
Name:
Replicase polyprotein 1ab
Synonyms:
ORF1ab polyprotein pp1ab | rep
Type:
Protein
Mol. Mass.:
794070.71
Organism:
2019-nCoV
Description:
P0DTD1
Residue:
7096
  
Inhibitor
Name:
BDBM533523
Synonyms:
jm2c00120, Compound 22
Type:
Small Organic Molecule
Emp. Form.:
C17H16ClN7O5S
Mol. Mass.:
465.871
SMILES:
Nc1ncnc2n(cnc12)[C@@H]1O[C@H](CNS(=O)(=O)c2ccc(Cl)c(c2)C#N)[C@@H](O)[C@H]1O
: