Target
Replicase polyprotein 1ab
Ligand
BDBM533524
Substrate
Meas. Tech.
MTase Filter-Binding Assay (FBA)
IC50
514±50 nM
Citation
 Ahmed-Belkacem, RHausdorff, MDelpal, ASutto-Ortiz, PColmant, AMGTouret, FOgando, NSSnijder, EJCanard, BCoutard, BVasseur, JJDecroly, EDebart, F Potent Inhibition of SARS-CoV-2 nsp14  J Med Chem 65:6231-6249 (2022)  
Target
Name:
Replicase polyprotein 1ab
Synonyms:
ORF1ab polyprotein pp1ab | rep
Type:
Protein
Mol. Mass.:
794070.71
Organism:
2019-nCoV
Description:
P0DTD1
Residue:
7096
  
Inhibitor
Name:
BDBM533524
Synonyms:
jm2c00120, Compound 23
Type:
Small Organic Molecule
Emp. Form.:
C18H19N7O6S
Mol. Mass.:
461.452
SMILES:
COc1ccc(cc1C#N)S(=O)(=O)NC[C@H]1O[C@H]([C@H](O)[C@@H]1O)n1cnc2c(N)ncnc12
: