Target
Phosphatidylinositol 4-kinase
Ligand
BDBM533765
Substrate
Meas. Tech.
PI(4)K enzymatic Assay
IC50
<100±n/a nM
Citation
 Michael, YJRobert, TMPeichao, L COMPOUNDS AND COMPOSITIONS FOR THE TREATMENT OF CRYPTOSPORIDIOSIS WIPO 0:0 (2022) Target
Name:
Phosphatidylinositol 4-kinase
Synonyms:
Type:
Protein
Mol. Mass.:
128976.50
Organism:
Description:
Q5CVD3
Residue:
1114
 
Inhibitor
Name:
BDBM533765
Synonyms:
WO2022079616, Example 1.02 | tert-Butyl 5-(3-(4-carbamoylphenyl)-N-methylpyrazolo[1,5-a]pyridine-5-carboxamido)-2-chlorobenzoate
Type:
Small organic molecule
Emp. Form.:
C27H25ClN4O4
Mol. Mass.:
504.965
SMILES:
CN(C(=O)c1ccn2ncc(-c3ccc(cc3)C(N)=O)c2c1)c1ccc(Cl)c(c1)C(=O)OC(C)(C)C
: